Reaction Details
TargetBone morphogenetic protein 4
LigandBDBM50262127
Substrate/Competitorn/a
Meas. Tech.ChEMBL_490878 (CHEMBL989154)
IC50 350±n/a nM
Citation Cuny, GDYu, PBLaha, JKXing, XLiu, JFLai, CSDeng, DYSachidanandan, CBloch, KDPeterson, RT Structure-activity relationship study of bone morphogenetic protein (BMP) signaling inhibitors. Bioorg Med Chem Lett18:4388-92 (2008) 
 
Bone morphogenetic protein 4
Name:Bone morphogenetic protein 4
Type:PROTEIN
Mol. Mass.:46572.96
Organism:Homo sapiens (Human)
Description:ChEMBL_1363193
Residue:408
BDBM50262127
NameBDBM50262127
Synonyms:7-chloro-4-(6-(4-(piperazin-1-yl)phenyl)pyrazolo[1,5-a]pyrimidin-3-yl)quinoline | CHEMBL468399
TypeSmall organic molecule
Emp. Form.C25H21ClN6
Mol. Mass.440.927
SMILESClc1ccc2c(ccnc2c1)-c1cnn2cc(cnc12)-c1ccc(cc1)N1CCNCC1