Reaction Details
TargetTranscriptional activator protein LuxR
LigandBDBM50262517
Substrate/Competitorn/a
Meas. Tech.ChEMBL_490917 (CHEMBL989193)
IC50 6900±n/a nM
Citation Estephane, JDauvergne, JSoulère, LReverchon, SQueneau, YDoutheau, A N-Acyl-3-amino-5H-furanone derivatives as new inhibitors of LuxR-dependent quorum sensing: Synthesis, biological evaluation and binding mode study. Bioorg Med Chem Lett18:4321-4 (2008) 
 
Transcriptional activator protein LuxR
Name:Transcriptional activator protein LuxR
Type:PROTEIN
Mol. Mass.:28563.86
Organism:Vibrio fischeri
Description:ChEMBL_831639
Residue:250
BDBM50262517
NameBDBM50262517
Synonyms:CHEMBL448263 | N-(4-chloro-2-oxo-2,5-dihydrofuran-3-yl)hexanamide
TypeSmall organic molecule
Emp. Form.C10H14ClNO3
Mol. Mass.231.676
SMILESCCCCCC(=O)NC1=C(Cl)COC1=O