Reaction Details
TargetCyclin-dependent kinase 1
LigandBDBM50214095
Substrate/Competitorn/a
Meas. Tech.ChEMBL_513579 (CHEMBL967075)
IC50 0.7±n/a nM
Citation Bharate, SBMahajan, TRGole, YRNambiar, MMatan, TTKulkarni-Almeida, ABalachandran, SJunjappa, HBalakrishnan, AVishwakarma, RA Synthesis and evaluation of pyrazolo[3,4-b]pyridines and its structural analogues as TNF-alpha and IL-6 inhibitors. Bioorg Med Chem16:7167-76 (2008) 
 
Cyclin-dependent kinase 1
Name:Cyclin-dependent kinase 1
Type:Enzyme Subunit
Mol. Mass.:34101.08
Organism:Homo sapiens (Human)
Description:P06493
Residue:297
BDBM50214095
NameBDBM50214095
Synonyms:CHEMBL248713 N-((5-(3-(5-fluoro-1H-benzo[d]imidazol-2-yl)-1H-pyrazolo[3,4-b]pyridin-5-yl)pyridin-3-yl)methyl)ethanamine
TypeSmall organic molecule
Emp. Form.C21H18FN7
Mol. Mass.387.4129
SMILESCCNCc1cncc(c1)-c1cnc2n[nH]c(-c3nc4ccc(F)cc4[nH]3)c2c1