Reaction Details
TargetCytochrome P450 2D6
LigandBDBM50262487
Substrate/Competitorn/a
Meas. Tech.ChEMBL_514590 (CHEMBL979968)
IC50>50000±n/a nM
Citation Sweeney, ZKDunn, JPLi, YHeilek, GDunten, PElworthy, TRHan, XHarris, SFHirschfeld, DRHogg, JHHuber, WKaiser, ACKertesz, DJKim, WMirzadegan, TRoepel, MGSaito, YDSilva, TMSwallow, STracy, JLVillasenor, AVora, HZhou, ASKlumpp, K Discovery and optimization of pyridazinone non-nucleoside inhibitors of HIV-1 reverse transcriptase. Bioorg Med Chem Lett18:4352-4 (2008) 
 
Cytochrome P450 2D6
Name:Cytochrome P450 2D6
Type:Protein
Mol. Mass.:55774.82
Organism:Homo sapiens (Human)
Description:P10635
Residue:497
BDBM50262487
NameBDBM50262487
Synonyms:3-(6-chloro-2-fluoro-3-((5-methyl-6-oxo-1,6-dihydropyridazin-3-yl)methyl)phenoxy)-5-fluorobenzonitrile | CHEMBL477145
TypeSmall organic molecule
Emp. Form.C19H12ClF2N3O2
Mol. Mass.387.767
SMILESCc1cc(Cc2ccc(Cl)c(Oc3cc(F)cc(c3)C#N)c2F)n[nH]c1=O