Reaction Details
TargetNeuropeptide Y receptor type 5
LigandBDBM50261721
Substrate/Competitorn/a
Meas. Tech.ChEMBL_509554 (CHEMBL997868)
Ki 93±n/a nM
Citation Sato, NJitsuoka, MShibata, THirohashi, TNonoshita, KMoriya, MHaga, YSakuraba, AAndo, MOhe, TIwaasa, HGomori, AIshihara, AKanatani, AFukami, T (9S)-9-(2-hydroxy-4,4-dimethyl-6-oxo-1-cyclohexen-1-yl)-3,3-dimethyl-2,3,4,9-tetrahydro-1H-xanthen-1-one, a selective and orally active neuropeptide Y Y5 receptor antagonist. J Med Chem51:4765-70 (2008) 
 
Neuropeptide Y receptor type 5
Name:Neuropeptide Y receptor type 5
Type:Enzyme
Mol. Mass.:50746.64
Organism:Homo sapiens (Human)
Description:Q15761
Residue:445
BDBM50261721
NameBDBM50261721
Synonyms:9-(2-Hydroxy-4,4-dimethyl-6-oxocyclohexyl)-6-methoxy-3,3-dimethyl-2,3,4,9-tetrahydro-1H-xanthen-1-one | CHEMBL468846
TypeSmall organic molecule
Emp. Form.C24H28O5
Mol. Mass.396.4761
SMILESCOc1ccc2C(C3C(=O)CC(C)(C)CC3=O)C3=C(CC(C)(C)CC3=O)Oc2c1