Reaction Details
TargetFatty-acid amide hydrolase 1 [30-579]
LigandBDBM50247035
Substrate/Competitorn/a
Meas. Tech.ChEMBL_557653 (CHEMBL961603)
Ki 3±n/a nM
Citation DeMartino, JKGarfunkle, JHochstatter, DGCravatt, BFBoger, DL Exploration of a fundamental substituent effect of alpha-ketoheterocycle enzyme inhibitors: Potent and selective inhibitors of fatty acid amide hydrolase. Bioorg Med Chem Lett18:5842-6 (2008) 
 
Fatty-acid amide hydrolase 1 [30-579]
Name:Fatty-acid amide hydrolase 1 [30-579]
Type:Single-pass membrane protein; homodimer
Mol. Mass.:60474.00
Organism:Rattus norvegicus (rat)
Description:P97612 (aa 30-579)
Residue:550
BDBM50247035
NameBDBM50247035
Synonyms:1-(4-bromooxazol-2-yl)-7-phenylheptan-1-one | CHEMBL448688
TypeSmall organic molecule
Emp. Form.C16H18BrNO2
Mol. Mass.336.224
SMILESBrc1coc(n1)C(=O)CCCCCCc1ccccc1