Reaction Details
TargetFatty-acid amide hydrolase 1 [30-579]
LigandBDBM50247075
Substrate/Competitorn/a
Meas. Tech.ChEMBL_557653 (CHEMBL961603)
Ki 18±n/a nM
Citation DeMartino, JKGarfunkle, JHochstatter, DGCravatt, BFBoger, DL Exploration of a fundamental substituent effect of alpha-ketoheterocycle enzyme inhibitors: Potent and selective inhibitors of fatty acid amide hydrolase. Bioorg Med Chem Lett18:5842-6 (2008) 
 
Fatty-acid amide hydrolase 1 [30-579]
Name:Fatty-acid amide hydrolase 1 [30-579]
Type:Single-pass membrane protein; homodimer
Mol. Mass.:60474.00
Organism:Rattus norvegicus (rat)
Description:P97612 (aa 30-579)
Residue:550
BDBM50247075
NameBDBM50247075
Synonyms:7-phenyl-1-(4-(pyridin-3-yl)oxazol-2-yl)heptan-1-one | CHEMBL462411
TypeSmall organic molecule
Emp. Form.C21H22N2O2
Mol. Mass.334.4116
SMILESO=C(CCCCCCc1ccccc1)c1nc(co1)-c1cccnc1