Reaction Details
TargetNeutral cholesterol ester hydrolase 1
LigandBDBM50204483
Substrate/Competitorn/a
Meas. Tech.ChEMBL_557654 (CHEMBL961604)
IC50>100000±n/a nM
Citation DeMartino, JKGarfunkle, JHochstatter, DGCravatt, BFBoger, DL Exploration of a fundamental substituent effect of alpha-ketoheterocycle enzyme inhibitors: Potent and selective inhibitors of fatty acid amide hydrolase. Bioorg Med Chem Lett18:5842-6 (2008) 
 
Neutral cholesterol ester hydrolase 1
Name:Neutral cholesterol ester hydrolase 1
Type:PROTEIN
Mol. Mass.:45810.81
Organism:Homo sapiens (Human)
Description:ChEMBL_835312
Residue:408
BDBM50204483
NameBDBM50204483
Synonyms:7-phenyl-1-(5-(trifluoromethyl)oxazol-2-yl)heptan-1-one | CHEMBL373606
TypeSmall organic molecule
Emp. Form.C17H18F3NO2
Mol. Mass.325.3255
SMILESFC(F)(F)c1cnc(o1)C(=O)CCCCCCc1ccccc1