Reaction Details
TargetFatty-acid amide hydrolase 1 [30-579]
LigandBDBM50204483
Substrate/Competitorn/a
Meas. Tech.ChEMBL_557653 (CHEMBL961603)
Ki 0.8±n/a nM
Citation DeMartino, JKGarfunkle, JHochstatter, DGCravatt, BFBoger, DL Exploration of a fundamental substituent effect of alpha-ketoheterocycle enzyme inhibitors: Potent and selective inhibitors of fatty acid amide hydrolase. Bioorg Med Chem Lett18:5842-6 (2008) 
 
Fatty-acid amide hydrolase 1 [30-579]
Name:Fatty-acid amide hydrolase 1 [30-579]
Type:Single-pass membrane protein; homodimer
Mol. Mass.:60474.00
Organism:Rattus norvegicus (rat)
Description:P97612 (aa 30-579)
Residue:550
BDBM50204483
NameBDBM50204483
Synonyms:7-phenyl-1-(5-(trifluoromethyl)oxazol-2-yl)heptan-1-one | CHEMBL373606
TypeSmall organic molecule
Emp. Form.C17H18F3NO2
Mol. Mass.325.3255
SMILESFC(F)(F)c1cnc(o1)C(=O)CCCCCCc1ccccc1