Reaction Details
TargetOxytocin receptor
LigandBDBM50262272
Substrate/Competitorn/a
Meas. Tech.ChEMBL_513959 (CHEMBL974600)
Ki 232±n/a nM
Citation Brown, ABrown, LEllis, DPuhalo, NSmith, CRWallace, OWatson, L Design and optimization of potent, selective antagonists of Oxytocin. Bioorg Med Chem Lett18:4278-81 (2008) 
 
Oxytocin receptor
Name:Oxytocin receptor
Type:Enzyme Catalytic Domain
Mol. Mass.:42793.26
Organism:Homo sapiens (Human)
Description:Oxytocin OXTR HEK293::B2R9L7
Residue:389
BDBM50262272
NameBDBM50262272
Synonyms:2-(4-(ethylthio)-2-methylphenyl)-5-(4-(6-methoxypyridin-3-yl)-5-methyl-4H-1,2,4-triazol-3-yl)pyrazine | CHEMBL467546
TypeSmall organic molecule
Emp. Form.C22H22N6OS
Mol. Mass.418.515
SMILESCCSc1ccc(c(C)c1)-c1cnc(cn1)-c1nnc(C)n1-c1ccc(OC)nc1