Reaction Details
TargetVasopressin V1a receptor
LigandBDBM50262271
Substrate/Competitorn/a
Meas. Tech.ChEMBL_513958 (CHEMBL974599)
Ki 202±n/a nM
Citation Brown, ABrown, LEllis, DPuhalo, NSmith, CRWallace, OWatson, L Design and optimization of potent, selective antagonists of Oxytocin. Bioorg Med Chem Lett18:4278-81 (2008) 
 
Vasopressin V1a receptor
Name:Vasopressin V1a receptor
Type:Receptor
Mol. Mass.:46820.18
Organism:Homo sapiens (Human)
Description:P37288
Residue:418
BDBM50262271
NameBDBM50262271
Synonyms:2-(2-chlorophenyl)-5-(4-(6-methoxypyridin-3-yl)-5-methyl-4H-1,2,4-triazol-3-yl)pyrazine | CHEMBL467545
TypeSmall organic molecule
Emp. Form.C19H15ClN6O
Mol. Mass.378.815
SMILESCOc1ccc(cn1)-n1c(C)nnc1-c1cnc(cn1)-c1ccccc1Cl