Reaction Details
TargetCannabinoid receptor 1
LigandBDBM50262564
Substrate/Competitorn/a
Meas. Tech.ChEMBL_514025 (CHEMBL976340)
EC50 910±n/a nM
Citation DiMauro, EFBuchanan, JLCheng, AEmkey, RHitchcock, SAHuang, LHuang, MYJanosky, BLee, JHLi, XMartin, MWTomlinson, SAWhite, RDZheng, XMPatel, VFFremeau, RT Structural modifications of N-arylamide oxadiazoles: Identification of N-arylpiperidine oxadiazoles as potent and selective agonists of CB2. Bioorg Med Chem Lett18:4267-74 (2008) 
 
Cannabinoid receptor 1
Name:Cannabinoid receptor 1
Type:G Protein-Coupled Receptor (GPCR)
Mol. Mass.:52868.96
Organism:Homo sapiens (Human)
Description:P21554
Residue:472
BDBM50262564
NameBDBM50262564
Synonyms:3-(4-(3-(2-chloro-4-fluorophenyl)-1,2,4-oxadiazol-5-yl)piperidin-1-yl)-5,6,7,8-tetrahydroquinoline | CHEMBL514543
TypeSmall organic molecule
Emp. Form.C22H22ClFN4O
Mol. Mass.412.888
SMILESFc1ccc(-c2noc(n2)C2CCN(CC2)c2cnc3CCCCc3c2)c(Cl)c1