Reaction Details
TargetHistamine H1 receptor
LigandBDBM50261729
Substrate/Competitorn/a
Meas. Tech.ChEMBL_514044 (CHEMBL979067)
IC50>50000±n/a nM
Citation DiMauro, EFBuchanan, JLCheng, AEmkey, RHitchcock, SAHuang, LHuang, MYJanosky, BLee, JHLi, XMartin, MWTomlinson, SAWhite, RDZheng, XMPatel, VFFremeau, RT Structural modifications of N-arylamide oxadiazoles: Identification of N-arylpiperidine oxadiazoles as potent and selective agonists of CB2. Bioorg Med Chem Lett18:4267-74 (2008) 
 
Histamine H1 receptor
Name:Histamine H1 receptor
Type:G Protein-Coupled Receptor (GPCR)
Mol. Mass.:55808.72
Organism:Homo sapiens (Human)
Description:Cell pellets from SK-N-MC cells transfected with human H1 receptor were used in binding assay.
Residue:487
BDBM50261729
NameBDBM50261729
Synonyms:6-chloro-3-(4-(3-(2-chloro-4-fluorophenyl)-1,2,4-oxadiazol-5-yl)piperidin-1-yl)quinoline | CHEMBL468176
TypeSmall organic molecule
Emp. Form.C22H17Cl2FN4O
Mol. Mass.443.301
SMILESFc1ccc(-c2noc(n2)C2CCN(CC2)c2cnc3ccc(Cl)cc3c2)c(Cl)c1