Reaction Details
TargetCannabinoid receptor 2
LigandBDBM50262508
Substrate/Competitorn/a
Meas. Tech.ChEMBL_514030 (CHEMBL976345)
EC50 17±n/a nM
Citation DiMauro, EFBuchanan, JLCheng, AEmkey, RHitchcock, SAHuang, LHuang, MYJanosky, BLee, JHLi, XMartin, MWTomlinson, SAWhite, RDZheng, XMPatel, VFFremeau, RT Structural modifications of N-arylamide oxadiazoles: Identification of N-arylpiperidine oxadiazoles as potent and selective agonists of CB2. Bioorg Med Chem Lett18:4267-74 (2008) 
 
Cannabinoid receptor 2
Name:Cannabinoid receptor 2
Type:G Protein-Coupled Receptor (GPCR)
Mol. Mass.:39690.94
Organism:Homo sapiens (Human)
Description:P34972
Residue:360
BDBM50262508
NameBDBM50262508
Synonyms:3-(4-(3-(2-chloro-4-fluorophenyl)-1,2,4-oxadiazol-5-yl)piperidin-1-yl)quinoline | CHEMBL478203
TypeSmall organic molecule
Emp. Form.C22H18ClFN4O
Mol. Mass.408.856
SMILESFc1ccc(-c2noc(n2)C2CCN(CC2)c2cnc3ccccc3c2)c(Cl)c1