Reaction Details
TargetCannabinoid receptor 2
LigandBDBM50261728
Substrate/Competitorn/a
Meas. Tech.ChEMBL_514022 (CHEMBL976337)
EC50 16±n/a nM
Citation DiMauro, EFBuchanan, JLCheng, AEmkey, RHitchcock, SAHuang, LHuang, MYJanosky, BLee, JHLi, XMartin, MWTomlinson, SAWhite, RDZheng, XMPatel, VFFremeau, RT Structural modifications of N-arylamide oxadiazoles: Identification of N-arylpiperidine oxadiazoles as potent and selective agonists of CB2. Bioorg Med Chem Lett18:4267-74 (2008) 
 
Cannabinoid receptor 2
Name:Cannabinoid receptor 2
Type:G Protein-Coupled Receptor (GPCR)
Mol. Mass.:39690.94
Organism:Homo sapiens (Human)
Description:P34972
Residue:360
BDBM50261728
NameBDBM50261728
Synonyms:3-(4-(3-(2-chloro-4-fluorophenyl)-1,2,4-oxadiazol-5-yl)piperidin-1-yl)-8-(trifluoromethyl)quinoline | CHEMBL468175
TypeSmall organic molecule
Emp. Form.C23H17ClF4N4O
Mol. Mass.476.854
SMILESFc1ccc(-c2noc(n2)C2CCN(CC2)c2cnc3c(cccc3c2)C(F)(F)F)c(Cl)c1