Reaction Details
TargetCannabinoid receptor 2
LigandBDBM50262565
Substrate/Competitorn/a
Meas. Tech.ChEMBL_514022 (CHEMBL976337)
EC50 32±n/a nM
Citation DiMauro, EFBuchanan, JLCheng, AEmkey, RHitchcock, SAHuang, LHuang, MYJanosky, BLee, JHLi, XMartin, MWTomlinson, SAWhite, RDZheng, XMPatel, VFFremeau, RT Structural modifications of N-arylamide oxadiazoles: Identification of N-arylpiperidine oxadiazoles as potent and selective agonists of CB2. Bioorg Med Chem Lett18:4267-74 (2008) 
 
Cannabinoid receptor 2
Name:Cannabinoid receptor 2
Type:G Protein-Coupled Receptor (GPCR)
Mol. Mass.:39690.94
Organism:Homo sapiens (Human)
Description:P34972
Residue:360
BDBM50262565
NameBDBM50262565
Synonyms:3-(4-(3-(2-chloro-4-fluorophenyl)-1,2,4-oxadiazol-5-yl)piperidin-1-yl)-8,8-dimethyl-5,6,7,8-tetrahydroquinoline | CHEMBL477797
TypeSmall organic molecule
Emp. Form.C24H26ClFN4O
Mol. Mass.440.941
SMILESCC1(C)CCCc2cc(cnc12)N1CCC(CC1)c1nc(no1)-c1ccc(F)cc1Cl