Reaction Details
TargetCannabinoid receptor 2
LigandBDBM50262449
Substrate/Competitorn/a
Meas. Tech.ChEMBL_514022 (CHEMBL976337)
EC50 53±n/a nM
Citation DiMauro, EFBuchanan, JLCheng, AEmkey, RHitchcock, SAHuang, LHuang, MYJanosky, BLee, JHLi, XMartin, MWTomlinson, SAWhite, RDZheng, XMPatel, VFFremeau, RT Structural modifications of N-arylamide oxadiazoles: Identification of N-arylpiperidine oxadiazoles as potent and selective agonists of CB2. Bioorg Med Chem Lett18:4267-74 (2008) 
 
Cannabinoid receptor 2
Name:Cannabinoid receptor 2
Type:G Protein-Coupled Receptor (GPCR)
Mol. Mass.:39690.94
Organism:Homo sapiens (Human)
Description:P34972
Residue:360
BDBM50262449
NameBDBM50262449
Synonyms:CHEMBL514706 | N-(4-(3-(2-chloro-4-fluorophenyl)-1,2,4-oxadiazol-5-yl)-2-methylbutan-2-yl)quinolin-3-amine
TypeSmall organic molecule
Emp. Form.C22H20ClFN4O
Mol. Mass.410.872
SMILESCC(C)(CCc1nc(no1)-c1ccc(F)cc1Cl)Nc1cnc2ccccc2c1