Reaction Details
TargetCytochrome P450 2D6
LigandBDBM50262280
Substrate/Competitorn/a
Meas. Tech.ChEMBL_514340 (CHEMBL967954)
Ki 70±n/a nM
Citation Shishido, YWakabayashi, HKoike, HUeno, NNukui, SYamagishi, TMurata, YNaganeo, FMizutani, MShimada, KFujiwara, YSakakibara, ASuga, OKusano, RUeda, SKanai, YTsuchiya, MSatake, K Discovery and stereoselective synthesis of the novel isochroman neurokinin-1 receptor antagonist 'CJ-17,493'. Bioorg Med Chem16:7193-205 (2008) 
 
Cytochrome P450 2D6
Name:Cytochrome P450 2D6
Type:Protein
Mol. Mass.:55774.82
Organism:Homo sapiens (Human)
Description:P10635
Residue:497
BDBM50262280
NameBDBM50262280
Synonyms:CHEMBL513351 | R/S-(2S,3S)-N-(2-methoxy-5-(1,1,1-trifluoropropan-2-yl)benzyl)-2-phenylpiperidin-3-amine
TypeSmall organic molecule
Emp. Form.C22H27F3N2O
Mol. Mass.392.4578
SMILESCOc1ccc(cc1CN[C@H]1CCCN[C@H]1c1ccccc1)C(C)C(F)(F)F