Reaction Details
TargetSubstance-P receptor
LigandBDBM50262566
Substrate/Competitorn/a
Meas. Tech.ChEMBL_514327 (CHEMBL967145)
Ki 0.2±n/a nM
Citation Shishido, YWakabayashi, HKoike, HUeno, NNukui, SYamagishi, TMurata, YNaganeo, FMizutani, MShimada, KFujiwara, YSakakibara, ASuga, OKusano, RUeda, SKanai, YTsuchiya, MSatake, K Discovery and stereoselective synthesis of the novel isochroman neurokinin-1 receptor antagonist 'CJ-17,493'. Bioorg Med Chem16:7193-205 (2008) 
 
Substance-P receptor
Name:Substance-P receptor
Type:G Protein-Coupled Receptor (GPCR)
Mol. Mass.:46254.43
Organism:Homo sapiens (Human)
Description:P25103
Residue:407
BDBM50262566
NameBDBM50262566
Synonyms:(2S,3S)-3-[(1R)-6-Methoxy-1-methyl-1-trifluoromethylisochroman-7-yl]methylamino-2-phenylpiperidine | CHEMBL478392
TypeSmall organic molecule
Emp. Form.C24H29F3N2O2
Mol. Mass.434.4945
SMILESCOc1cc2CCO[C@](C)(c2cc1CN[C@H]1CCCN[C@H]1c1ccccc1)C(F)(F)F