Reaction Details
TargetAmine oxidase [flavin-containing] A
LigandBDBM50261815
Substrate/Competitorn/a
Meas. Tech.ChEMBL_514663 (CHEMBL975557)
Ki 231000±n/a nM
Citation Hruschka, SRosen, TCYoshida, SKirk, KLFröhlich, RWibbeling, BHaufe, G Fluorinated phenylcyclopropylamines. Part 5: Effects of electron-withdrawing or -donating aryl substituents on the inhibition of monoamine oxidases A and B by 2-aryl-2-fluoro-cyclopropylamines. Bioorg Med Chem16:7148-66 (2008) 
 
Amine oxidase [flavin-containing] A
Name:Amine oxidase [flavin-containing] A
Type:Protein
Mol. Mass.:59689.53
Organism:Homo sapiens (Human)
Description:P21397
Residue:527
BDBM50261815
NameBDBM50261815
Synonyms:2-(3,4-dimethoxyphenyl)-3-fluoroprop-2-en-1-amine | CHEMBL445285
TypeSmall organic molecule
Emp. Form.C11H14FNO2
Mol. Mass.211.2328
SMILESCOc1ccc(cc1OC)C(\CN)=C/F