Reaction Details
TargetNeuronal acetylcholine receptor subunit alpha-7
LigandBDBM50135594
Substrate/Competitorn/a
Meas. Tech.ChEMBL_509579 (CHEMBL1000465)
Ki 2790±n/a nM
Citation Rizzi, LDallanoce, CMatera, CMagrone, PPucci, LGotti, CClementi, FDe Amici, M Epiboxidine and novel-related analogues: a convenient synthetic approach and estimation of their affinity at neuronal nicotinic acetylcholine receptor subtypes. Bioorg Med Chem Lett18:4651-4 (2008) 
 
Neuronal acetylcholine receptor subunit alpha-7
Name:Neuronal acetylcholine receptor subunit alpha-7
Type:Enzyme
Mol. Mass.:56502.44
Organism:Rattus norvegicus (Rat)
Description:Q05941
Residue:502
BDBM50135594
NameBDBM50135594
Synonyms:(+/-)-2-(6-chloropyridin-3-yl)-9-aza-bicyclo[4.2.1]non-2-ene CHEMBL63102 | UB-165
TypeSmall organic molecule
Emp. Form.C13H15ClN2
Mol. Mass.234.725
SMILESClc1ccc(cn1)C1=CCCC2CCC1N2