Reaction Details
TargetNeuronal acetylcholine receptor subunit alpha-4
LigandBDBM50261766
Substrate/Competitorn/a
Meas. Tech.ChEMBL_509581 (CHEMBL1000467)
Ki 7.6±n/a nM
Citation Rizzi, LDallanoce, CMatera, CMagrone, PPucci, LGotti, CClementi, FDe Amici, M Epiboxidine and novel-related analogues: a convenient synthetic approach and estimation of their affinity at neuronal nicotinic acetylcholine receptor subtypes. Bioorg Med Chem Lett18:4651-4 (2008) 
 
Neuronal acetylcholine receptor subunit alpha-4
Name:Neuronal acetylcholine receptor subunit alpha-4
Type:n/a
Mol. Mass.:69963.49
Organism:Homo sapiens (Human)
Description:NACHRA4
Residue:627
BDBM50261766
NameBDBM50261766
Synonyms:(+/-)-exo-(1R,2R,4R)-2-(6-chloropyridin-3-yl)-7-aza-bicyclo[2.2.1]heptane | CHEMBL513692
TypeSmall organic molecule
Emp. Form.C11H13ClN2
Mol. Mass.208.687
SMILESClc1ccc(cn1)[C@H]1C[C@H]2CC[C@H]1N2