Reaction Details
TargetPhosphatidylinositol 4,5-bisphosphate 3-kinase catalytic subunit delta isoform
LigandBDBM50262173
Substrate/Competitorn/a
Meas. Tech.ChEMBL_509591 (CHEMBL1001352)
IC50 16±n/a nM
Citation Perry, BAlexander, RBennett, GBuckley, GCeska, TCrabbe, TDale, VGowers, LHorsley, HJames, LJenkins, KCrépy, KKulisa, CLightfoot, HLock, CMack, SMorgan, TNicolas, ALPitt, WSabin, VWright, S Achieving multi-isoform PI3K inhibition in a series of substituted 3,4-dihydro-2H-benzo[1,4]oxazines. Bioorg Med Chem Lett18:4700-4 (2008) 
 
Phosphatidylinositol 4,5-bisphosphate 3-kinase catalytic subunit delta isoform
Name:Phosphatidylinositol 4,5-bisphosphate 3-kinase catalytic subunit delta isoform
Type:Enzyme Subunit
Mol. Mass.:119489.41
Organism:Homo sapiens (Human)
Description:O00329
Residue:1044
BDBM50262173
NameBDBM50262173
Synonyms:2-(6-(1H-pyrazol-4-yl)-2,3-dihydrobenzo[b][1,4]oxazin-4-yl)-6,6-dimethyl-6,7-dihydrothiazolo[5,4-c]pyridin-4(5H)-one CHEMBL512092
TypeSmall organic molecule
Emp. Form.C19H19N5O2S
Mol. Mass.381.451
SMILESCC1(C)Cc2nc(sc2C(=O)N1)N1CCOc2ccc(cc12)-c1cn[nH]c1