Reaction Details
TargetSodium-dependent serotonin transporter
LigandBDBM25870
Substrate/Competitorn/a
Meas. Tech.ChEMBL_509624 (CHEMBL1001385)
Ki 4.38±n/a nM
Citation Funke, UFischer, SHiller, AScheunemann, MDeuther-Conrad, WBrust, PSteinbach, J 3-(4-(6-Fluoroalkoxy-3,4-dihydroisoquinoline-2(1H)-yl)cyclohexyl)-1H-indole-5-carbonitriles for SERT imaging: chemical synthesis, evaluation in vitro and radiofluorination. Bioorg Med Chem Lett18:4727-30 (2008) 
 
Sodium-dependent serotonin transporter
Name:Sodium-dependent serotonin transporter
Type:Multi-pass membrane protein
Mol. Mass.:70322.51
Organism:Homo sapiens (Human)
Description:P31645
Residue:630
BDBM25870
NameBDBM25870
Synonyms:1-[3-(dimethylamino)propyl]-1-(4-fluorophenyl)-1,3-dihydro-2-benzofuran-5-carbonitrile CITALOPRAM Escitalopram [3H]Cytalopram [3H]Lexapro
Typeradiolabeled ligand
Emp. Form.C20H21FN2O
Mol. Mass.324.3919
SMILESCN(C)CCCC1(OCc2cc(ccc12)C#N)c1ccc(F)cc1