Reaction Details
TargetLuciferin 4-monooxygenase
LigandBDBM50261868
Substrate/Competitorn/a
Meas. Tech.ChEMBL_509645 (CHEMBL1003973)
IC50 560±n/a nM
Citation Heitman, LHvan Veldhoven, JPZweemer, AMYe, KBrussee, JIJzerman, AP False positives in a reporter gene assay: identification and synthesis of substituted N-pyridin-2-ylbenzamides as competitive inhibitors of firefly luciferase. J Med Chem51:4724-9 (2008) 
 
Luciferin 4-monooxygenase
Name:Luciferin 4-monooxygenase
Type:PROTEIN
Mol. Mass.:60126.66
Organism:Luciola lateralis
Description:ChEMBL_786225
Residue:548
BDBM50261868
NameBDBM50261868
Synonyms:CHEMBL512625 | N-[5-(4-Chorophenyl)pyridin-2-yl]benzamide
TypeSmall organic molecule
Emp. Form.C18H13ClN2O
Mol. Mass.308.762
SMILESClc1ccc(cc1)-c1ccc(NC(=O)c2ccccc2)nc1