Reaction Details
TargetFructose-1,6-bisphosphatase 1
LigandBDBM50273194
Substrate/Competitorn/a
Meas. Tech.ChEMBL_513688 (CHEMBL974538)
IC50 12±n/a nM
Citation Hebeisen, PKuhn, BKohler, PGubler, MHuber, WKitas, ESchott, BBenz, JJoseph, CRuf, A Allosteric FBPase inhibitors gain 10(5) times in potency when simultaneously binding two neighboring AMP sites. Bioorg Med Chem Lett18:4708-12 (2008) 
 
Fructose-1,6-bisphosphatase 1
Name:Fructose-1,6-bisphosphatase 1
Type:Protein
Mol. Mass.:36843.58
Organism:Homo sapiens (Human)
Description:Liver FBPase (P09467)
Residue:338
BDBM50273194
NameBDBM50273194
Synonyms:1-[(3-methylbenzene)sulfonyl]-3-(2-{[2-({[(3-methylbenzene)sulfonyl]carbamoyl}amino)ethyl]disulfanyl}ethyl)urea | CHEMBL458056
TypeSmall organic molecule
Emp. Form.C20H26N4O6S4
Mol. Mass.546.704
SMILESCc1cccc(c1)S(=O)(=O)NC(=O)NCCSSCCNC(=O)NS(=O)(=O)c1cccc(C)c1