Reaction Details
TargetFructose-1,6-bisphosphatase 1
LigandBDBM50273102
Substrate/Competitorn/a
Meas. Tech.ChEMBL_513687 (CHEMBL974537)
IC50 6±n/a nM
Citation Hebeisen, PKuhn, BKohler, PGubler, MHuber, WKitas, ESchott, BBenz, JJoseph, CRuf, A Allosteric FBPase inhibitors gain 10(5) times in potency when simultaneously binding two neighboring AMP sites. Bioorg Med Chem Lett18:4708-12 (2008) 
 
Fructose-1,6-bisphosphatase 1
Name:Fructose-1,6-bisphosphatase 1
Type:Protein
Mol. Mass.:36843.58
Organism:Homo sapiens (Human)
Description:Liver FBPase (P09467)
Residue:338
BDBM50273102
NameBDBM50273102
Synonyms:3-[(3-chlorobenzene)sulfonyl]-1-({4-[({[(3-chlorobenzene)sulfonyl]carbamoyl}amino)methyl]phenyl}methyl)urea | CHEMBL462978
TypeSmall organic molecule
Emp. Form.C22H20Cl2N4O6S2
Mol. Mass.571.453
SMILESClc1cccc(c1)S(=O)(=O)NC(=O)NCc1ccc(CNC(=O)NS(=O)(=O)c2cccc(Cl)c2)cc1