Reaction Details
TargetGamma-aminobutyric acid receptor subunit alpha-6
LigandBDBM50273002
Substrate/Competitorn/a
Meas. Tech.ChEMBL_514410 (CHEMBL971728)
EC50 30000±n/a nM
Citation Jansen, MRabe, HStrehle, ADieler, SDebus, FDannhardt, GAkabas, MHLüddens, H Synthesis of GABAA receptor agonists and evaluation of their alpha-subunit selectivity and orientation in the GABA binding site. J Med Chem51:4430-48 (2008) 
 
Gamma-aminobutyric acid receptor subunit alpha-6
Name:Gamma-aminobutyric acid receptor subunit alpha-6
Type:Enzyme Catalytic Domain
Mol. Mass.:51188.24
Organism:RAT
Description:GABA A Alpha6Beta2Gamma2 0 RAT::P30191
Residue:453
BDBM50273002
NameBDBM50273002
Synonyms:5-Aminomethyl-3H-[1,3,4]oxadiazol-2-one Hydrochloride | CHEMBL454608
TypeSmall organic molecule
Emp. Form.C3H5N3O2
Mol. Mass.115.0907
SMILESNCc1n[nH]c(=O)o1