Reaction Details
TargetEpidermal growth factor receptor
LigandBDBM50240214
Substrate/Competitorn/a
Meas. Tech.ChEMBL_509684 (CHEMBL1007322)
IC50 8±n/a nM
Citation Xu, GAbad, MCConnolly, PJNeeper, MPStruble, GTSpringer, BAEmanuel, SLPandey, NGruninger, RHAdams, MMoreno-Mazza, SFuentes-Pesquera, ARMiddleton, SA 4-Amino-6-arylamino-pyrimidine-5-carbaldehyde hydrazones as potent ErbB-2/EGFR dual kinase inhibitors. Bioorg Med Chem Lett18:4615-9 (2008) 
 
Epidermal growth factor receptor
Name:Epidermal growth factor receptor
Type:Receptor Kinase Domain
Mol. Mass.:134279.59
Organism:Homo sapiens (Human)
Description:P00533
Residue:1210
BDBM50240214
NameBDBM50240214
Synonyms:4-(1-(3-fluorobenzyl)-1H-indazol-5-ylamino)-6-aminopyrimidine-5-carbaldehyde O-methyl oxime | CHEMBL255871
TypeSmall organic molecule
Emp. Form.C20H18FN7O
Mol. Mass.391.4016
SMILESCO\N=C\c1c(N)ncnc1Nc1ccc2n(Cc3cccc(F)c3)ncc2c1