Reaction Details
TargetReceptor tyrosine-protein kinase erbB-2
LigandBDBM50272881
Substrate/Competitorn/a
Meas. Tech.ChEMBL_509683 (CHEMBL1007321)
IC50 8±n/a nM
Citation Xu, GAbad, MCConnolly, PJNeeper, MPStruble, GTSpringer, BAEmanuel, SLPandey, NGruninger, RHAdams, MMoreno-Mazza, SFuentes-Pesquera, ARMiddleton, SA 4-Amino-6-arylamino-pyrimidine-5-carbaldehyde hydrazones as potent ErbB-2/EGFR dual kinase inhibitors. Bioorg Med Chem Lett18:4615-9 (2008) 
 
Receptor tyrosine-protein kinase erbB-2
Name:Receptor tyrosine-protein kinase erbB-2
Type:n/a
Mol. Mass.:137894.47
Organism:Homo sapiens (Human)
Description:P04626
Residue:1255
BDBM50272881
NameBDBM50272881
Synonyms:2-(4-((4-(1-(3-fluorobenzyl)-1H-indazol-5-ylamino)-6-aminopyrimidin-5-yl)methyleneamino)piperazin-1-yl)ethanol | CHEMBL514566
TypeSmall organic molecule
Emp. Form.C25H28FN9O
Mol. Mass.489.5479
SMILESNc1ncnc(Nc2ccc3n(Cc4cccc(F)c4)ncc3c2)c1\C=N\N1CCN(CCO)CC1