Reaction Details
TargetReceptor tyrosine-protein kinase erbB-2
LigandBDBM50272844
Substrate/Competitorn/a
Meas. Tech.ChEMBL_509685 (CHEMBL1007323)
IC50 15±n/a nM
Citation Xu, GAbad, MCConnolly, PJNeeper, MPStruble, GTSpringer, BAEmanuel, SLPandey, NGruninger, RHAdams, MMoreno-Mazza, SFuentes-Pesquera, ARMiddleton, SA 4-Amino-6-arylamino-pyrimidine-5-carbaldehyde hydrazones as potent ErbB-2/EGFR dual kinase inhibitors. Bioorg Med Chem Lett18:4615-9 (2008) 
 
Receptor tyrosine-protein kinase erbB-2
Name:Receptor tyrosine-protein kinase erbB-2
Type:n/a
Mol. Mass.:137894.47
Organism:Homo sapiens (Human)
Description:P04626
Residue:1255
BDBM50272844
NameBDBM50272844
Synonyms:5-(Dimethyl-hydrazonomethyl)-N-[1-(3-fluoro-benzyl)-1H-indazol-5-yl]-pyrimidine-4,6-diamine | CHEMBL497459
TypeSmall organic molecule
Emp. Form.C21H21FN8
Mol. Mass.404.4434
SMILESCN(C)\N=C\c1c(N)ncnc1Nc1ccc2n(Cc3cccc(F)c3)ncc2c1