Reaction Details
TargetTransient receptor potential cation channel subfamily V member 1
LigandBDBM50272850
Substrate/Competitorn/a
Meas. Tech.ChEMBL_514811 (CHEMBL976420)
IC50 0.500000±n/a nM
Citation Blum, CAZheng, XBrielmann, HHodgetts, KJBakthavatchalam, RChandrasekhar, JKrause, JECortright, DMatson, DCrandall, MNgo, CKFung, LDay, MKershaw, MDe Lombaert, SChenard, BL Aminoquinazolines as TRPV1 antagonists: modulation of drug-like properties through the exploration of 2-position substitution. Bioorg Med Chem Lett18:4573-7 (2008) 
 
Transient receptor potential cation channel subfamily V member 1
Name:Transient receptor potential cation channel subfamily V member 1
Type:Transient Receptor
Mol. Mass.:94956.12
Organism:Rattus norvegicus (rat)
Description:O35433
Residue:838
BDBM50272850
NameBDBM50272850
Synonyms:2-(methoxymethyl)-N-(4-(trifluoromethyl)phenyl)-7-(3-(trifluoromethyl)pyridin-2-yl)quinazolin-4-amine | CHEMBL497650
TypeSmall organic molecule
Emp. Form.C23H16F6N4O
Mol. Mass.478.3898
SMILESCOCc1nc(Nc2ccc(cc2)C(F)(F)F)c2ccc(cc2n1)-c1ncccc1C(F)(F)F