Reaction Details
TargetTransient receptor potential cation channel subfamily V member 1
LigandBDBM50273057
Substrate/Competitorn/a
Meas. Tech.ChEMBL_509750 (CHEMBL997019)
Ki 137±n/a nM
Citation Cheung, WSCalvo, RRTounge, BAZhang, SPStone, DRBrandt, MRHutchinson, TFlores, CMPlayer, MR Discovery of piperidine carboxamide TRPV1 antagonists. Bioorg Med Chem Lett18:4569-72 (2008) 
 
Transient receptor potential cation channel subfamily V member 1
Name:Transient receptor potential cation channel subfamily V member 1
Type:Protein
Mol. Mass.:94960.75
Organism:Homo sapiens (Human)
Description:Q8NER1
Residue:839
BDBM50273057
NameBDBM50273057
Synonyms:1-(3,5-difluorophenyl)-N-(3-oxo-3,4-dihydro-2H-benzo[b][1,4]oxazin-6-yl)piperidine-4-carboxamide | CHEMBL449104
TypeSmall organic molecule
Emp. Form.C20H19F2N3O3
Mol. Mass.387.38
SMILESFc1cc(F)cc(c1)N1CCC(CC1)C(=O)Nc1ccc2OCC(=O)Nc2c1