Reaction Details
TargetCathepsin S
LigandBDBM50273288
Substrate/Competitorn/a
Meas. Tech.ChEMBL_509759 (CHEMBL997028)
IC50 2±n/a nM
Citation Irie, OYokokawa, FEhara, TIwasaki, AIwaki, YHitomi, YKonishi, KKishida, MToyao, AMasuya, KGunji, HSakaki, JIwasaki, GHirao, HKanazawa, TTanabe, KKosaka, THart, TWHallett, A 4-Amino-2-cyanopyrimidines: novel scaffold for nonpeptidic cathepsin S inhibitors. Bioorg Med Chem Lett18:4642-6 (2008) 
 
Cathepsin S
Name:Cathepsin S
Type:Protein
Mol. Mass.:37507.38
Organism:Homo sapiens (Human)
Description:P25774
Residue:331
BDBM50273288
NameBDBM50273288
Synonyms:2-Cyano-4-[(spiro[2.5]oct-6-ylmethyl)-amino]-pyrimidine-5-carboxylic acid (4-benzyl-1-methyl-piperidin-4-yl)-amide | CHEMBL456135
TypeSmall organic molecule
Emp. Form.C28H36N6O
Mol. Mass.472.625
SMILESCN1CCC(Cc2ccccc2)(CC1)NC(=O)c1cnc(nc1NCC1CCC2(CC2)CC1)C#N