Reaction Details
TargetCathepsin S
LigandBDBM50272786
Substrate/Competitorn/a
Meas. Tech.ChEMBL_509759 (CHEMBL997028)
IC50 2±n/a nM
Citation Irie, OYokokawa, FEhara, TIwasaki, AIwaki, YHitomi, YKonishi, KKishida, MToyao, AMasuya, KGunji, HSakaki, JIwasaki, GHirao, HKanazawa, TTanabe, KKosaka, THart, TWHallett, A 4-Amino-2-cyanopyrimidines: novel scaffold for nonpeptidic cathepsin S inhibitors. Bioorg Med Chem Lett18:4642-6 (2008) 
 
Cathepsin S
Name:Cathepsin S
Type:Protein
Mol. Mass.:37507.38
Organism:Homo sapiens (Human)
Description:P25774
Residue:331
BDBM50272786
NameBDBM50272786
Synonyms:5-Bromo-4-[2-(1-methyl-piperidin-4-yl)-ethoxy]-6-[(spiro[2.5]oct-6-ylmethyl)-amino]-pyrimidine-2-carbonitrile | CHEMBL526107
TypeSmall organic molecule
Emp. Form.C22H32BrN5O
Mol. Mass.462.426
SMILESCN1CCC(CCOc2nc(nc(NCC3CCC4(CC4)CC3)c2Br)C#N)CC1