Reaction Details
TargetAcetylcholinesterase
LigandBDBM50273221
Substrate/Competitorn/a
Meas. Tech.ChEMBL_509818 (CHEMBL1000499)
IC50 0.78±n/a nM
Citation Shen, YSheng, RZhang, JHe, QYang, BHu, Y 2-Phenoxy-indan-1-one derivatives as acetylcholinesterase inhibitors: a study on the importance of modifications at the side chain on the activity. Bioorg Med Chem16:7646-53 (2008) 
 
Acetylcholinesterase
Name:Acetylcholinesterase
Type:Enzyme
Mol. Mass.:68193.62
Organism:Rattus norvegicus (rat)
Description:P37136
Residue:614
BDBM50273221
NameBDBM50273221
Synonyms:2-(4-(3-(Diethylamino)propanoyl)phenoxy)-5,6-dimethoxy-indan-1-one | CHEMBL456967
TypeSmall organic molecule
Emp. Form.C24H29NO5
Mol. Mass.411.4908
SMILESCCN(CC)CCC(=O)c1ccc(OC2Cc3cc(OC)c(OC)cc3C2=O)cc1