Reaction Details
TargetCalcitonin gene-related peptide type 1 receptor
LigandBDBM50273290
Substrate/Competitorn/a
Meas. Tech.ChEMBL_509823 (CHEMBL1000504)
Ki 0.550000±n/a nM
Citation Degnan, APChaturvedula, PVConway, CMCook, DADavis, CDDenton, RHan, XMacci, RMathias, NRMoench, PPin, SSRen, SXSchartman, RSignor, LJThalody, GWidmann, KAXu, CMacor, JEDubowchik, GM Discovery of (R)-4-(8-fluoro-2-oxo-1,2-dihydroquinazolin-3(4H)-yl)-N-(3-(7-methyl-1H-indazol-5-yl)-1-oxo-1-(4-(piperidin-1-yl)piperidin-1-yl)propan-2-yl)piperidine-1-carboxamide (BMS-694153): a potent antagonist of the human calcitonin gene-related peptide receptor for migraine with rapid and effic J Med Chem51:4858-61 (2008) 
 
Calcitonin gene-related peptide type 1 receptor
Name:Calcitonin gene-related peptide type 1 receptor
Type:Enzyme Catalytic Domain
Mol. Mass.:52980.45
Organism:Homo sapiens (Human)
Description:Q16602
Residue:461
BDBM50273290
NameBDBM50273290
Synonyms:(R)-N-(1-(1,4'-bipiperidin-1'-yl)-3-(benzo[b]thiophen-3-yl)-1-oxopropan-2-yl)-4-(2-oxo-1,2-dihydroquinazolin-3(4H)-yl)piperidine-1-carboxamide | CHEMBL466555
TypeSmall organic molecule
Emp. Form.C35H44N6O3S
Mol. Mass.628.827
SMILESO=C(N[C@H](Cc1csc2ccccc12)C(=O)N1CCC(CC1)N1CCCCC1)N1CCC(CC1)N1Cc2ccccc2NC1=O