Reaction Details
TargetCytochrome P450 1A2
LigandBDBM50268484
Substrate/Competitorn/a
Meas. Tech.ChEMBL_509829 (CHEMBL1000510)
IC50>40000±n/a nM
Citation Degnan, APChaturvedula, PVConway, CMCook, DADavis, CDDenton, RHan, XMacci, RMathias, NRMoench, PPin, SSRen, SXSchartman, RSignor, LJThalody, GWidmann, KAXu, CMacor, JEDubowchik, GM Discovery of (R)-4-(8-fluoro-2-oxo-1,2-dihydroquinazolin-3(4H)-yl)-N-(3-(7-methyl-1H-indazol-5-yl)-1-oxo-1-(4-(piperidin-1-yl)piperidin-1-yl)propan-2-yl)piperidine-1-carboxamide (BMS-694153): a potent antagonist of the human calcitonin gene-related peptide receptor for migraine with rapid and effic J Med Chem51:4858-61 (2008) 
 
Cytochrome P450 1A2
Name:Cytochrome P450 1A2
Type:Enzyme
Mol. Mass.:58423.38
Organism:Homo sapiens (Human)
Description:P05177
Residue:516
BDBM50268484
NameBDBM50268484
Synonyms:(R)-4-(8-Fluoro-2-oxo-1,2-dihydroquinazolin-3(4H)-yl)-N-(3-(7-methyl-1H-indazol-5-yl)-1-oxo-1-(4-(piperidin-1-yl)piperidin-1-yl)propan-2-yl)piperidine-1-carboxamide BMS-694153 | CHEMBL450668
TypeSmall organic molecule
Emp. Form.C35H45FN8O3
Mol. Mass.644.782
SMILESCc1cc(C[C@@H](NC(=O)N2CCC(CC2)N2Cc3cccc(F)c3NC2=O)C(=O)N2CCC(CC2)N2CCCCC2)cc2cn[nH]c12