Reaction Details
TargetHydroxycarboxylic acid receptor 2
LigandBDBM50132140
Substrate/Competitorn/a
Meas. Tech.ChEMBL_509903 (CHEMBL1002173)
EC50 860±n/a nM
Citation Semple, GSkinner, PJGharbaoui, TShin, YJJung, JKCherrier, MCWebb, PJTamura, SYBoatman, PDSage, CRSchrader, TOChen, RColletti, SLTata, JRWaters, MGCheng, KTaggart, AKCai, TQCarballo-Jane, EBehan, DPConnolly, DTRichman, JG 3-(1H-tetrazol-5-yl)-1,4,5,6-tetrahydro-cyclopentapyrazole (MK-0354): a partial agonist of the nicotinic acid receptor, G-protein coupled receptor 109a, with antilipolytic but no vasodilatory activity in mice. J Med Chem51:5101-8 (2008) 
 
Hydroxycarboxylic acid receptor 2
Name:Hydroxycarboxylic acid receptor 2
Type:G Protein-Coupled Receptor (GPCR)
Mol. Mass.:41868.22
Organism:Homo sapiens (Human)
Description:Membranes from CHO cells expressing the recombinant human GPR109A were used in competition binding assay.
Residue:363
BDBM50132140
NameBDBM50132140
Synonyms:1,4,5,6-Tetrahydro-cyclopentapyrazole-3-carboxylic acid 2,4,5,6-tetrahydrocyclopenta[c]pyrazole-3-carboxylate CHEMBL128604
TypeSmall organic molecule
Emp. Form.C7H8N2O2
Mol. Mass.152.1506
SMILESOC(=O)c1n[nH]c2CCCc12