Reaction Details
TargetHydroxycarboxylic acid receptor 2
LigandBDBM50273099
Substrate/Competitorn/a
Meas. Tech.ChEMBL_509912 (CHEMBL1002182)
EC50 2300±n/a nM
Citation Semple, GSkinner, PJGharbaoui, TShin, YJJung, JKCherrier, MCWebb, PJTamura, SYBoatman, PDSage, CRSchrader, TOChen, RColletti, SLTata, JRWaters, MGCheng, KTaggart, AKCai, TQCarballo-Jane, EBehan, DPConnolly, DTRichman, JG 3-(1H-tetrazol-5-yl)-1,4,5,6-tetrahydro-cyclopentapyrazole (MK-0354): a partial agonist of the nicotinic acid receptor, G-protein coupled receptor 109a, with antilipolytic but no vasodilatory activity in mice. J Med Chem51:5101-8 (2008) 
 
Hydroxycarboxylic acid receptor 2
Name:Hydroxycarboxylic acid receptor 2
Type:PROTEIN
Mol. Mass.:41476.06
Organism:Rattus norvegicus
Description:ChEMBL_820675
Residue:360
BDBM50273099
NameBDBM50273099
Synonyms:3-(1H-tetrazol-5-yl)-1,4,5,6-tetrahydrocyclopenta[c]pyrazole CHEMBL456145 | MK-0354
TypeSmall organic molecule
Emp. Form.C7H8N6
Mol. Mass.176.1786
SMILESC1Cc2[nH]nc(c2C1)-c1nnn[nH]1