Reaction Details
TargetHydroxycarboxylic acid receptor 2
LigandBDBM23515
Substrate/Competitorn/a
Meas. Tech.ChEMBL_509907 (CHEMBL1002177)
Ki 50±n/a nM
Citation Semple, GSkinner, PJGharbaoui, TShin, YJJung, JKCherrier, MCWebb, PJTamura, SYBoatman, PDSage, CRSchrader, TOChen, RColletti, SLTata, JRWaters, MGCheng, KTaggart, AKCai, TQCarballo-Jane, EBehan, DPConnolly, DTRichman, JG 3-(1H-tetrazol-5-yl)-1,4,5,6-tetrahydro-cyclopentapyrazole (MK-0354): a partial agonist of the nicotinic acid receptor, G-protein coupled receptor 109a, with antilipolytic but no vasodilatory activity in mice. J Med Chem51:5101-8 (2008) 
 
Hydroxycarboxylic acid receptor 2
Name:Hydroxycarboxylic acid receptor 2
Type:G Protein-Coupled Receptor (GPCR)
Mol. Mass.:41868.22
Organism:Homo sapiens (Human)
Description:Membranes from CHO cells expressing the recombinant human GPR109A were used in competition binding assay.
Residue:363
BDBM23515
NameBDBM23515
Synonyms:CHEMBL573 Nicotinic Acid pyridine-3-carboxylic acid | wampocap
TypeSmall organic molecule
Emp. Form.C6H5NO2
Mol. Mass.123.1094
SMILESOC(=O)c1cccnc1