Reaction Details
TargetAryl hydrocarbon receptor
LigandBDBM50240990
Substrate/Competitorn/a
Meas. Tech.ChEMBL_510004 (CHEMBL1005597)
Ki 6.8±n/a nM
Citation Aiello, SWells, GStone, ELKadri, HBazzi, RBell, DRStevens, MFMatthews, CSBradshaw, TDWestwell, AD Synthesis and biological properties of benzothiazole, benzoxazole, and chromen-4-one analogues of the potent antitumor agent 2-(3,4-dimethoxyphenyl)-5-fluorobenzothiazole (PMX 610, NSC 721648). J Med Chem51:5135-9 (2008) 
 
Aryl hydrocarbon receptor
Name:Aryl hydrocarbon receptor
Type:PROTEIN
Mol. Mass.:96224.95
Organism:Rattus norvegicus
Description:ChEMBL_510004
Residue:853
BDBM50240990
NameBDBM50240990
Synonyms:2-(3,4-dimethoxyphenyl)-5-fluorobenzothiazole CHEMBL373251 | NSC-721648
TypeSmall organic molecule
Emp. Form.C15H12FNO2S
Mol. Mass.289.325
SMILESCOc1ccc(cc1OC)-c1nc2cc(F)ccc2s1