Reaction Details
TargetCoagulation factor X
LigandBDBM50273231
Substrate/Competitorn/a
Meas. Tech.ChEMBL_510032 (CHEMBL995175)
Ki 3700±n/a nM
Citation Uchida, MOkazaki, KMukaiyama, HIsawa, HKobayashi, HShiohara, HMuranaka, HKai, YKikuchi, NTakeuchi, HYokoyama, KTsuji, EOzawa, THoyano, YKoizumi, TMisawa, KHara, KNakano, SMurakami, YOkuno, H Orally active factor Xa inhibitors: investigation of a novel series of 3-amidinophenylsulfonamide derivatives using an amidoxime prodrug strategy. Bioorg Med Chem Lett18:4682-7 (2008) 
 
Coagulation factor X
Name:Coagulation factor X
Type:Enzyme
Mol. Mass.:54726.60
Organism:Homo sapiens (Human)
Description:n/a
Residue:488
BDBM50273231
NameBDBM50273231
Synonyms:CHEMBL455919 | ethyl 2-(N-(4-isopropylphenethyl)-2-hydroxy-5-(N'-hydroxycarbamimidoyl)phenylsulfonamido)acetate
TypeSmall organic molecule
Emp. Form.C22H29N3O6S
Mol. Mass.463.547
SMILESCCOC(=O)CN(CCc1ccc(cc1)C(C)C)S(=O)(=O)c1cc(ccc1O)C(=N)NO