Reaction Details
TargetCoagulation factor X
LigandBDBM50273137
Substrate/Competitorn/a
Meas. Tech.ChEMBL_510032 (CHEMBL995175)
Ki 1.73±n/a nM
Citation Uchida, MOkazaki, KMukaiyama, HIsawa, HKobayashi, HShiohara, HMuranaka, HKai, YKikuchi, NTakeuchi, HYokoyama, KTsuji, EOzawa, THoyano, YKoizumi, TMisawa, KHara, KNakano, SMurakami, YOkuno, H Orally active factor Xa inhibitors: investigation of a novel series of 3-amidinophenylsulfonamide derivatives using an amidoxime prodrug strategy. Bioorg Med Chem Lett18:4682-7 (2008) 
 
Coagulation factor X
Name:Coagulation factor X
Type:Enzyme
Mol. Mass.:54726.60
Organism:Homo sapiens (Human)
Description:n/a
Residue:488
BDBM50273137
NameBDBM50273137
Synonyms:(3-{[(3-Carbamimidoyl-phenyl)-({4-[1-(1-imino-ethyl)-piperidin-4-yl]-phenylcarbamoyl}-methyl)-amino]-methyl}-phenoxy)-acetic acid | CHEMBL463385
TypeSmall organic molecule
Emp. Form.C31H36N6O4
Mol. Mass.556.6553
SMILESCC(=N)N1CCC(CC1)c1ccc(NC(=O)CN(Cc2cccc(OCC(O)=O)c2)c2cccc(c2)C(N)=N)cc1