Reaction Details
TargetGonadotropin-releasing hormone receptor
LigandBDBM50272662
Substrate/Competitorn/a
Meas. Tech.ChEMBL_510057 (CHEMBL995200)
Ki 1±n/a nM
Citation Regan, CFGuo, ZChen, YHuang, CQChen, MJiang, WRueter, JKCoon, TChen, CSaunders, JBrown, MSBetz, SFStruthers, RSYang, CWen, JMadan, AZhu, YF Zwitterionic uracil derivatives as potent GnRH receptor antagonists with improved pharmaceutical properties. Bioorg Med Chem Lett18:4503-7 (2008) 
 
Gonadotropin-releasing hormone receptor
Name:Gonadotropin-releasing hormone receptor
Type:Enzyme
Mol. Mass.:37749.45
Organism:Homo sapiens (Human)
Description:P30968
Residue:328
BDBM50272662
NameBDBM50272662
Synonyms:(R)-5-(3-(1-(2-fluoro-6-(trifluoromethyl)benzyl)-3-(2-amino-2-phenylethyl)-6-methyl-2,4-dioxo-1,2,3,4-tetrahydropyrimidin-5-yl)-2-fluorophenoxy)pentanoic acid | CHEMBL454774
TypeSmall organic molecule
Emp. Form.C32H30F5N3O5
Mol. Mass.631.5897
SMILESCc1c(-c2cccc(OCCCCC(O)=O)c2F)c(=O)n(C[C@H](N)c2ccccc2)c(=O)n1Cc1c(F)cccc1C(F)(F)F