Reaction Details
TargetGonadotropin-releasing hormone receptor
LigandBDBM50272673
Substrate/Competitorn/a
Meas. Tech.ChEMBL_510057 (CHEMBL995200)
Ki 38±n/a nM
Citation Regan, CFGuo, ZChen, YHuang, CQChen, MJiang, WRueter, JKCoon, TChen, CSaunders, JBrown, MSBetz, SFStruthers, RSYang, CWen, JMadan, AZhu, YF Zwitterionic uracil derivatives as potent GnRH receptor antagonists with improved pharmaceutical properties. Bioorg Med Chem Lett18:4503-7 (2008) 
 
Gonadotropin-releasing hormone receptor
Name:Gonadotropin-releasing hormone receptor
Type:Enzyme
Mol. Mass.:37749.45
Organism:Homo sapiens (Human)
Description:P30968
Residue:328
BDBM50272673
NameBDBM50272673
Synonyms:(R)-2-(3-(3-(1-(2-fluoro-6-(trifluoromethyl)benzyl)-6-methyl-3-(2-(methylamino)-2-phenylethyl)-2,4-dioxo-1,2,3,4-tetrahydropyrimidin-5-yl)-2-fluorophenoxy)propoxy)acetic acid | CHEMBL509347
TypeSmall organic molecule
Emp. Form.C33H32F5N3O6
Mol. Mass.661.6157
SMILESCN[C@@H](Cn1c(=O)c(c(C)n(Cc2c(F)cccc2C(F)(F)F)c1=O)-c1cccc(OCCCOCC(O)=O)c1F)c1ccccc1