Reaction Details
TargetGonadotropin-releasing hormone receptor
LigandBDBM50260714
Substrate/Competitorn/a
Meas. Tech.ChEMBL_510058 (CHEMBL995201)
Ki 110±n/a nM
Citation Regan, CFGuo, ZChen, YHuang, CQChen, MJiang, WRueter, JKCoon, TChen, CSaunders, JBrown, MSBetz, SFStruthers, RSYang, CWen, JMadan, AZhu, YF Zwitterionic uracil derivatives as potent GnRH receptor antagonists with improved pharmaceutical properties. Bioorg Med Chem Lett18:4503-7 (2008) 
 
Gonadotropin-releasing hormone receptor
Name:Gonadotropin-releasing hormone receptor
Type:Enzyme
Mol. Mass.:37749.45
Organism:Homo sapiens (Human)
Description:P30968
Residue:328
BDBM50260714
NameBDBM50260714
Synonyms:(R)-ethyl 2-(4-(1-(2-fluoro-6-(trifluoromethyl)benzyl)-3-(2-amino-2-phenylethyl)-2,4-dioxo-1,2,3,4-tetrahydropyrimidin-5-yl)benzylamino)acetate | CHEMBL503624
TypeSmall organic molecule
Emp. Form.C31H30F4N4O4
Mol. Mass.598.5879
SMILESCCOC(=O)CNCc1ccc(cc1)-c1cn(Cc2c(F)cccc2C(F)(F)F)c(=O)n(C[C@H](N)c2ccccc2)c1=O