Reaction Details
TargetReceptor tyrosine-protein kinase erbB-4
LigandBDBM4567
Substrate/Competitorn/a
Meas. Tech.ChEMBL_540160 (CHEMBL1026508)
IC50 12±n/a nM
Citation Hur, WVelentza, AKim, SFlatauer, LJiang, XValente, DMason, DESuzuki, MLarson, BZhang, JZagorska, ADidonato, MNagle, AWarmuth, MBalk, SPPeters, ECGray, NS Clinical stage EGFR inhibitors irreversibly alkylate Bmx kinase. Bioorg Med Chem Lett18:5916-9 (2008) 
 
Receptor tyrosine-protein kinase erbB-4
Name:Receptor tyrosine-protein kinase erbB-4
Type:Protein
Mol. Mass.:146803.56
Organism:Homo sapiens (Human)
Description:Q15303
Residue:1308
BDBM4567
NameBDBM4567
Synonyms:4-anilinoquinazoline deriv. 2 CHEMBL285063 US9422297, PD168393
TypeSmall organic molecule
Emp. Form.C17H13BrN4O
Mol. Mass.369.215
SMILESBrc1cccc(Nc2ncnc3ccc(NC(=O)C=C)cc23)c1