Reaction Details
TargetTyrosine-protein kinase BTK
LigandBDBM4567
Substrate/Competitorn/a
Meas. Tech.ChEMBL_540165 (CHEMBL1026513)
IC50 5830±n/a nM
Citation Hur, WVelentza, AKim, SFlatauer, LJiang, XValente, DMason, DESuzuki, MLarson, BZhang, JZagorska, ADidonato, MNagle, AWarmuth, MBalk, SPPeters, ECGray, NS Clinical stage EGFR inhibitors irreversibly alkylate Bmx kinase. Bioorg Med Chem Lett18:5916-9 (2008) 
 
Tyrosine-protein kinase BTK
Name:Tyrosine-protein kinase BTK
Type:Enzyme
Mol. Mass.:76289.95
Organism:Homo sapiens (Human)
Description:Q06187
Residue:659
BDBM4567
NameBDBM4567
Synonyms:4-anilinoquinazoline deriv. 2 CHEMBL285063 US9422297, PD168393
TypeSmall organic molecule
Emp. Form.C17H13BrN4O
Mol. Mass.369.215
SMILESBrc1cccc(Nc2ncnc3ccc(NC(=O)C=C)cc23)c1