Reaction Details
TargetProstaglandin G/H synthase 1
LigandBDBM50090676
Substrate/Competitorn/a
Meas. Tech.ChEMBL_510079 (CHEMBL997884)
IC50 560±n/a nM
Citation Bézière, NGoossens, LPommery, JVezin, HTouati, NHénichart, JPPommery, N New NSAIDs-NO hybrid molecules with antiproliferative properties on human prostatic cancer cell lines. Bioorg Med Chem Lett18:4655-7 (2008) 
 
Prostaglandin G/H synthase 1
Name:Prostaglandin G/H synthase 1
Type:Enzyme
Mol. Mass.:68692.62
Organism:Homo sapiens (Human)
Description:P23219
Residue:599
BDBM50090676
NameBDBM50090676
Synonyms:(+-)-2-(p-(2-thenoyl)phenyl)propionic acid 2-[4-(thiophen-2-ylcarbonyl)phenyl]propanoic acid CHEMBL956 alpha-methyl-4-(2-thienylcarbonyl)benzeneacetic acid | p-2-thenoylhydratropic acid
TypeSmall organic molecule
Emp. Form.C14H12O3S
Mol. Mass.260.308
SMILESCC(C(O)=O)c1ccc(cc1)C(=O)c1cccs1